Reaction Details
TargetCytohesin-3
LigandBDBM50013327
Substrate/Competitorn/a
Meas. Tech.ChEMBL_1348972 (CHEMBL3265619)
IC50 38000±n/a nM
Citation Kim, YYoon, Y Elucidation of different inhibition mechanism of small chemicals on PtdInsP-binding domains using in silico docking experiments. Bioorg Med Chem Lett24:2256-62 (2014) 
 
Cytohesin-3
Name:Cytohesin-3
Type:Enzyme
Mol. Mass.:46340.05
Organism:Homo sapiens (Human)
Description:O43739
Residue:400
BDBM50013327
NameBDBM50013327
Synonyms:CHEMBL3263343
TypeSmall organic molecule
Emp. Form.C4H5N2O5P
Mol. Mass.192.0667
SMILESOC(=O)c1cc(n[nH]1)P(O)(O)=O