Reaction Details
TargetHeat shock protein HSP 90-beta
LigandBDBM50013692
Substrate/Competitorn/a
Meas. Tech.ChEMBL_1349362 (CHEMBL3269585)
IC50 64000±n/a nM
Citation Bhat, RAdam, ATLee, JJGasiewicz, TAHenry, ECRotella, DP Towards the discovery of drug-like epigallocatechin gallate analogs as Hsp90 inhibitors. Bioorg Med Chem Lett24:2263-6 (2014) 
 
Heat shock protein HSP 90-beta
Name:Heat shock protein HSP 90-beta
Type:Molecular Chaperone
Mol. Mass.:83229.45
Organism:Homo sapiens (Human)
Description:P08238
Residue:724
BDBM50013692
NameBDBM50013692
Synonyms:CHEMBL3264528
TypeSmall organic molecule
Emp. Form.C21H17NO8
Mol. Mass.411.3616
SMILESOc1cc(O)c2C[C@@H](OC(=O)c3ccncc3)[C@H](Oc2c1)c1cc(O)c(O)c(O)c1