Reaction Details
TargetHeat shock protein HSP 90-beta
LigandBDBM50013694
Substrate/Competitorn/a
Meas. Tech.ChEMBL_1349362 (CHEMBL3269585)
IC50 75000±n/a nM
Citation Bhat, RAdam, ATLee, JJGasiewicz, TAHenry, ECRotella, DP Towards the discovery of drug-like epigallocatechin gallate analogs as Hsp90 inhibitors. Bioorg Med Chem Lett24:2263-6 (2014) 
 
Heat shock protein HSP 90-beta
Name:Heat shock protein HSP 90-beta
Type:Molecular Chaperone
Mol. Mass.:83229.45
Organism:Homo sapiens (Human)
Description:P08238
Residue:724
BDBM50013694
NameBDBM50013694
Synonyms:CHEMBL3264530
TypeSmall organic molecule
Emp. Form.C22H19NO7
Mol. Mass.409.3888
SMILESOc1cc(O)c2C[C@@H](NC(=O)c3ccccc3)[C@H](Oc2c1)c1cc(O)c(O)c(O)c1