Reaction Details
TargetHeat shock protein HSP 90-beta
LigandBDBM50013709
Substrate/Competitorn/a
Meas. Tech.ChEMBL_1349362 (CHEMBL3269585)
IC50 63000±n/a nM
Citation Bhat, RAdam, ATLee, JJGasiewicz, TAHenry, ECRotella, DP Towards the discovery of drug-like epigallocatechin gallate analogs as Hsp90 inhibitors. Bioorg Med Chem Lett24:2263-6 (2014) 
 
Heat shock protein HSP 90-beta
Name:Heat shock protein HSP 90-beta
Type:Molecular Chaperone
Mol. Mass.:83229.45
Organism:Homo sapiens (Human)
Description:P08238
Residue:724
BDBM50013709
NameBDBM50013709
Synonyms:CHEMBL3264541
TypeSmall organic molecule
Emp. Form.C22H18O5
Mol. Mass.362.3753
SMILESOc1cc(O)c2C[C@@H](OC(=O)c3ccccc3)[C@H](Oc2c1)c1ccccc1