Reaction Details
TargetInduced myeloid leukemia cell differentiation protein Mcl-1
LigandBDBM50013843
Substrate/Competitorn/a
Meas. Tech.ChEMBL_1349703 (CHEMBL3266887)
IC50 11570±n/a nM
Citation Abulwerdi, FALiao, CMady, ASGavin, JShen, CCierpicki, TStuckey, JAShowalter, HDNikolovska-Coleska, Z 3-Substituted-N-(4-hydroxynaphthalen-1-yl)arylsulfonamides as a novel class of selective Mcl-1 inhibitors: structure-based design, synthesis, SAR, and biological evaluation. J Med Chem57:4111-33 (2014) 
 
Induced myeloid leukemia cell differentiation protein Mcl-1
Name:Induced myeloid leukemia cell differentiation protein Mcl-1
Type:Membrane; Single-pass membrane protein
Mol. Mass.:37332.87
Organism:Homo sapiens (Human)
Description:Q07820
Residue:350
BDBM50013843
NameBDBM50013843
Synonyms:CHEMBL1868007
TypeSmall organic molecule
Emp. Form.C19H17NO5S2
Mol. Mass.403.472
SMILESCc1ccc(cc1)S(=O)(=O)Nc1cc(SCC(O)=O)c(O)c2ccccc12