Reaction Details
TargetBcl-2-related protein A1
LigandBDBM50013863
Substrate/Competitorn/a
Meas. Tech.ChEMBL_1349699 (CHEMBL3266883)
Ki 3180±n/a nM
Citation Abulwerdi, FALiao, CMady, ASGavin, JShen, CCierpicki, TStuckey, JAShowalter, HDNikolovska-Coleska, Z 3-Substituted-N-(4-hydroxynaphthalen-1-yl)arylsulfonamides as a novel class of selective Mcl-1 inhibitors: structure-based design, synthesis, SAR, and biological evaluation. J Med Chem57:4111-33 (2014) 
 
Bcl-2-related protein A1
Name:Bcl-2-related protein A1
Type:Apoptosis regulator protein
Mol. Mass.:20130.01
Organism:Homo sapiens (Human)
Description:n/a
Residue:175
BDBM50013863
NameBDBM50013863
Synonyms:CHEMBL3265295
TypeSmall organic molecule
Emp. Form.C24H19NO5S2
Mol. Mass.465.541
SMILESOC(=O)CSc1cc(NS(=O)(=O)c2cccc(c2)-c2ccccc2)c2ccccc2c1O