Reaction Details
TargetInduced myeloid leukemia cell differentiation protein Mcl-1
LigandBDBM50013839
Substrate/Competitorn/a
Meas. Tech.ChEMBL_1349702 (CHEMBL3266886)
Ki 1550±n/a nM
Citation Abulwerdi, FALiao, CMady, ASGavin, JShen, CCierpicki, TStuckey, JAShowalter, HDNikolovska-Coleska, Z 3-Substituted-N-(4-hydroxynaphthalen-1-yl)arylsulfonamides as a novel class of selective Mcl-1 inhibitors: structure-based design, synthesis, SAR, and biological evaluation. J Med Chem57:4111-33 (2014) 
 
Induced myeloid leukemia cell differentiation protein Mcl-1
Name:Induced myeloid leukemia cell differentiation protein Mcl-1
Type:Membrane; Single-pass membrane protein
Mol. Mass.:37332.87
Organism:Homo sapiens (Human)
Description:Q07820
Residue:350
BDBM50013839
NameBDBM50013839
Synonyms:CHEMBL2030270
TypeSmall organic molecule
Emp. Form.C16H13NO5S3
Mol. Mass.395.473
SMILESOC(=O)CSc1cc(NS(=O)(=O)c2cccs2)c2ccccc2c1O