Reaction Details
TargetInduced myeloid leukemia cell differentiation protein Mcl-1
LigandBDBM50013845
Substrate/Competitorn/a
Meas. Tech.ChEMBL_1349702 (CHEMBL3266886)
Ki 810±n/a nM
Citation Abulwerdi, FALiao, CMady, ASGavin, JShen, CCierpicki, TStuckey, JAShowalter, HDNikolovska-Coleska, Z 3-Substituted-N-(4-hydroxynaphthalen-1-yl)arylsulfonamides as a novel class of selective Mcl-1 inhibitors: structure-based design, synthesis, SAR, and biological evaluation. J Med Chem57:4111-33 (2014) 
 
Induced myeloid leukemia cell differentiation protein Mcl-1
Name:Induced myeloid leukemia cell differentiation protein Mcl-1
Type:Membrane; Single-pass membrane protein
Mol. Mass.:37332.87
Organism:Homo sapiens (Human)
Description:Q07820
Residue:350
BDBM50013845
NameBDBM50013845
Synonyms:CHEMBL3265290
TypeSmall organic molecule
Emp. Form.C22H23NO5S2
Mol. Mass.445.552
SMILESCC(C)(C)c1ccc(cc1)S(=O)(=O)Nc1cc(SCC(O)=O)c(O)c2ccccc12