Reaction Details
TargetE3 ubiquitin-protein ligase Mdm2
LigandBDBM50014091
Substrate/Competitorn/a
Meas. Tech.ChEMBL_1350281 (CHEMBL3267619)
Ki 1800±n/a nM
Citation Guo, WWisniewski, JAJi, H Hot spot-based design of small-molecule inhibitors for protein-protein interactions. Bioorg Med Chem Lett24:2546-54 (2014) 
 
E3 ubiquitin-protein ligase Mdm2
Name:E3 ubiquitin-protein ligase Mdm2
Type:Oncoprotein
Mol. Mass.:55196.54
Organism:Homo sapiens (Human)
Description:Q00987
Residue:491
BDBM50014091
NameBDBM50014091
Synonyms:CHEMBL3260847
TypeSmall organic molecule
Emp. Form.C23H24ClN3O4
Mol. Mass.441.907
SMILESCC(C)(C)NC(=O)C(N(Cc1ccccc1)C=O)c1c([nH]c2cc(Cl)ccc12)C(O)=O