Reaction Details
TargetTranscription factor 7-like 2
LigandBDBM50014098
Substrate/Competitorn/a
Meas. Tech.ChEMBL_1350287 (CHEMBL3267625)
Ki 1350±n/a nM
Citation Guo, WWisniewski, JAJi, H Hot spot-based design of small-molecule inhibitors for protein-protein interactions. Bioorg Med Chem Lett24:2546-54 (2014) 
 
Transcription factor 7-like 2
Name:Transcription factor 7-like 2
Type:PROTEIN
Mol. Mass.:67939.08
Organism:Homo sapiens (Human)
Description:ChEMBL_107937
Residue:619
BDBM50014098
NameBDBM50014098
Synonyms:CHEMBL3260852
TypeSmall organic molecule
Emp. Form.C10H9N5O2
Mol. Mass.231.2108
SMILESOc1noc2cc(CCc3nn[nH]n3)ccc12