Reaction Details
TargetD-alanyl-D-alanine dipeptidase
LigandBDBM50014155
Substrate/Competitorn/a
Meas. Tech.ChEMBL_1350288 (CHEMBL3267626)
Ki 1500±n/a nM
Citation Muthyala, RRastogi, NShin, WSPeterson, MLSham, YY Cell permeable vanX inhibitors as vancomycin re-sensitizing agents. Bioorg Med Chem Lett24:2535-8 (2014) 
 
D-alanyl-D-alanine dipeptidase
Name:D-alanyl-D-alanine dipeptidase
Type:PROTEIN
Mol. Mass.:23377.40
Organism:Enterococcus faecium
Description:ChEMBL_1350288
Residue:202
BDBM50014155
NameBDBM50014155
Synonyms:CHEMBL3260854
TypeSmall organic molecule
Emp. Form.C6H14NO4P
Mol. Mass.195.1534
SMILESC[C@@H](N)P(O)(=O)C[C@@H](C)C(O)=O