Reaction Details
TargetD-alanyl-D-alanine dipeptidase
LigandBDBM50014157
Substrate/Competitorn/a
Meas. Tech.ChEMBL_1350288 (CHEMBL3267626)
Ki 2900±n/a nM
Citation Muthyala, RRastogi, NShin, WSPeterson, MLSham, YY Cell permeable vanX inhibitors as vancomycin re-sensitizing agents. Bioorg Med Chem Lett24:2535-8 (2014) 
 
D-alanyl-D-alanine dipeptidase
Name:D-alanyl-D-alanine dipeptidase
Type:PROTEIN
Mol. Mass.:23377.40
Organism:Enterococcus faecium
Description:ChEMBL_1350288
Residue:202
BDBM50014157
NameBDBM50014157
Synonyms:CHEMBL3260855
TypeSmall organic molecule
Emp. Form.C11H16NO4P
Mol. Mass.257.2228
SMILESC[C@@H](N)P(O)(=O)C[C@H](C(O)=O)c1ccccc1