Reaction Details
TargetD-alanyl-D-alanine dipeptidase
LigandBDBM50014160
Substrate/Competitorn/a
Meas. Tech.ChEMBL_1350288 (CHEMBL3267626)
Ki 6840±n/a nM
Citation Muthyala, RRastogi, NShin, WSPeterson, MLSham, YY Cell permeable vanX inhibitors as vancomycin re-sensitizing agents. Bioorg Med Chem Lett24:2535-8 (2014) 
 
D-alanyl-D-alanine dipeptidase
Name:D-alanyl-D-alanine dipeptidase
Type:PROTEIN
Mol. Mass.:23377.40
Organism:Enterococcus faecium
Description:ChEMBL_1350288
Residue:202
BDBM50014160
NameBDBM50014160
Synonyms:CHEMBL3260857
TypeSmall organic molecule
Emp. Form.C9H10N2O4S
Mol. Mass.242.252
SMILESC[C@@H](NC(=O)c1cccc(=S)n1O)C(O)=O