Reaction Details
TargetKappa-type opioid receptor
LigandBDBM50015005
Substrate/Competitorn/a
Meas. Tech.ChEMBL_1347894 (CHEMBL3267130)
Ki 3.8±n/a nM
Citation Kumar, VRidzwan, IEGrivas, KLewis, JWClark, MJMeurice, CJimenez-Gomez, CPogozheva, IMosberg, HTraynor, JRHusbands, SM Selectively promiscuous opioid ligands: discovery of high affinity/low efficacy opioid ligands with substantial nociceptin opioid peptide receptor affinity. J Med Chem57:4049-57 (2014) 
 
Kappa-type opioid receptor
Name:Kappa-type opioid receptor
Type:G Protein-Coupled Receptor (GPCR)
Mol. Mass.:42648.76
Organism:Homo sapiens (Human)
Description:P41145
Residue:380
BDBM50015005
NameBDBM50015005
Synonyms:CHEMBL3262093 US9480684, 13b, R = Ph- BU125
TypeSmall organic molecule
Emp. Form.C30H33NO4
Mol. Mass.471.5873
SMILES[H][C@@]12Oc3c4c(C[C@@]5([H])N(CC6CC6)CC[C@@]14[C@]51C[C@]([H])([C@H](O)c4ccccc4)[C@]2(OC)C=C1)ccc3O