Reaction Details
TargetMu-type opioid receptor
LigandBDBM50354578
Substrate/Competitorn/a
Meas. Tech.ChEMBL_1347903 (CHEMBL3267139)
EC50 10±n/a nM
Citation Kumar, VRidzwan, IEGrivas, KLewis, JWClark, MJMeurice, CJimenez-Gomez, CPogozheva, IMosberg, HTraynor, JRHusbands, SM Selectively promiscuous opioid ligands: discovery of high affinity/low efficacy opioid ligands with substantial nociceptin opioid peptide receptor affinity. J Med Chem57:4049-57 (2014) 
 
Mu-type opioid receptor
Name:Mu-type opioid receptor
Type:G Protein-Coupled Receptor (GPCR)
Mol. Mass.:44789.51
Organism:Homo sapiens (Human)
Description:P35372
Residue:400
BDBM50354578
NameBDBM50354578
Synonyms:BUPRENORPHINE US11534436, Compound buprenorphine | US9315514, Buprenorphine
TypeSmall organic molecule
Emp. Form.C29H41NO4
Mol. Mass.467.6401
SMILESCO[C@@]12CC[C@@]3(C[C@@H]1[C@](C)(O)C(C)(C)C)[C@H]1Cc4ccc(O)c5O[C@@H]2[C@]3(CCN1CC1CC1)c45