Reaction Details
TargetMu-type opioid receptor
LigandBDBM50015010
Substrate/Competitorn/a
Meas. Tech.ChEMBL_1347903 (CHEMBL3267139)
EC50 18±n/a nM
Citation Kumar, VRidzwan, IEGrivas, KLewis, JWClark, MJMeurice, CJimenez-Gomez, CPogozheva, IMosberg, HTraynor, JRHusbands, SM Selectively promiscuous opioid ligands: discovery of high affinity/low efficacy opioid ligands with substantial nociceptin opioid peptide receptor affinity. J Med Chem57:4049-57 (2014) 
 
Mu-type opioid receptor
Name:Mu-type opioid receptor
Type:G Protein-Coupled Receptor (GPCR)
Mol. Mass.:44789.51
Organism:Homo sapiens (Human)
Description:P35372
Residue:400
BDBM50015010
NameBDBM50015010
Synonyms:CHEMBL3262091
TypeSmall organic molecule
Emp. Form.C32H39NO4
Mol. Mass.501.6564
SMILES[H][C@@]12Oc3c4c(C[C@@]5([H])N(CC6CC6)CC[C@@]14[C@@]51CC[C@@]2(OC)[C@]([H])(C1)[C@@](O)(CC)c1ccccc1)ccc3O