Reaction Details
TargetKappa-type opioid receptor
LigandBDBM50015007
Substrate/Competitorn/a
Meas. Tech.ChEMBL_1347904 (CHEMBL3267140)
EC50 183±n/a nM
Citation Kumar, VRidzwan, IEGrivas, KLewis, JWClark, MJMeurice, CJimenez-Gomez, CPogozheva, IMosberg, HTraynor, JRHusbands, SM Selectively promiscuous opioid ligands: discovery of high affinity/low efficacy opioid ligands with substantial nociceptin opioid peptide receptor affinity. J Med Chem57:4049-57 (2014) 
 
Kappa-type opioid receptor
Name:Kappa-type opioid receptor
Type:G Protein-Coupled Receptor (GPCR)
Mol. Mass.:42648.76
Organism:Homo sapiens (Human)
Description:P41145
Residue:380
BDBM50015007
NameBDBM50015007
Synonyms:CHEMBL3262088
TypeSmall organic molecule
Emp. Form.C30H43NO4
Mol. Mass.481.6667
SMILES[H][C@@]12Oc3c4c(C[C@@]5([H])N(CC6CC6)CC[C@@]14[C@@]51CC[C@@]2(OC)[C@]([H])(C1)[C@@](O)(CC)C(C)(C)C)ccc3O