Reaction Details
TargetMu-type opioid receptor
LigandBDBM50015004
Substrate/Competitorn/a
Meas. Tech.ChEMBL_1348090 (CHEMBL3269119)
Ki 0.600000±n/a nM
Citation Kumar, VRidzwan, IEGrivas, KLewis, JWClark, MJMeurice, CJimenez-Gomez, CPogozheva, IMosberg, HTraynor, JRHusbands, SM Selectively promiscuous opioid ligands: discovery of high affinity/low efficacy opioid ligands with substantial nociceptin opioid peptide receptor affinity. J Med Chem57:4049-57 (2014) 
 
Mu-type opioid receptor
Name:Mu-type opioid receptor
Type:G Protein-Coupled Receptor (GPCR)
Mol. Mass.:44503.11
Organism:Rattus norvegicus (rat)
Description:Competition binding assays were carried out using membrane preparations from transfected HN9.10 cells that constitutively expressed the mu opioid receptor.
Residue:398
BDBM50015004
NameBDBM50015004
Synonyms:CHEMBL3262372 US9480684, 7a, R = 2- thienyl- BU08026
TypeSmall organic molecule
Emp. Form.C29H35NO4S
Mol. Mass.493.657
SMILES[H][C@@]12Oc3c4c(C[C@@]5([H])N(CC6CC6)CC[C@@]14[C@@]51CC[C@@]2(OC)[C@]([H])(C1)[C@](C)(O)c1cccs1)ccc3O