Reaction Details
TargetD(2) dopamine receptor
LigandBDBM50015501
Substrate/Competitorn/a
Meas. Tech.ChEMBL_1348403 (CHEMBL3265956)
Ki 30±n/a nM
Citation Wängler, CChowdhury, SHöfner, GDjurova, PPurisima, EOBartenstein, PWängler, BFricker, GWanner, KTSchirrmacher, R Shuttle-cargo fusion molecules of transport peptides and the hD2/3 receptor antagonist fallypride: a feasible approach to preserve ligand-receptor binding? J Med Chem57:4368-81 (2014) 
 
D(2) dopamine receptor
Name:D(2) dopamine receptor
Type:Cell-surface receptors
Mol. Mass.:50647.10
Organism:Homo sapiens (Human)
Description:P14416
Residue:443
BDBM50015501
NameBDBM50015501
Synonyms:CHEMBL3265047
TypeSmall organic molecule
Emp. Form.C77H112N18O18S
Mol. Mass.1609.888
SMILESCC[C@H](C)[C@H](NC(=O)[C@H](C)NC(=O)[C@H](Cc1cnc[nH]1)NC(=O)COCCOCCNC(=O)CCCCCN1C(=O)CC(SCCCc2cc(OC)c(OC)c(c2)C(=O)NC[C@@H]2CCCN2CC=C)C1=O)C(=O)N[C@@H](Cc1ccc(O)cc1)C(=O)N1CCC[C@H]1C(=O)N[C@@H](CCCNC(N)=N)C(=O)N[C@@H](Cc1cnc[nH]1)C(O)=O