Reaction Details
TargetD(2) dopamine receptor
LigandBDBM50015531
Substrate/Competitorn/a
Meas. Tech.ChEMBL_1348403 (CHEMBL3265956)
Ki 64±n/a nM
Citation Wängler, CChowdhury, SHöfner, GDjurova, PPurisima, EOBartenstein, PWängler, BFricker, GWanner, KTSchirrmacher, R Shuttle-cargo fusion molecules of transport peptides and the hD2/3 receptor antagonist fallypride: a feasible approach to preserve ligand-receptor binding? J Med Chem57:4368-81 (2014) 
 
D(2) dopamine receptor
Name:D(2) dopamine receptor
Type:Cell-surface receptors
Mol. Mass.:50647.10
Organism:Homo sapiens (Human)
Description:P14416
Residue:443
BDBM50015531
NameBDBM50015531
Synonyms:CHEMBL3265323
TypeSmall organic molecule
Emp. Form.C169H236N37O44S
Mol. Mass.3521.968
SMILESCOc1cc(CCCSC2CC(=O)N(CCCCCC(=O)N[C@@H]([C@@H](C)O)C(=O)N[C@@H](Cc3ccccc3)C(=O)N[C@@H](Cc3ccccc3)C(=O)N[C@@H](Cc3ccc(O)cc3)C(=O)NCC(=O)NCC(=O)N[C@@H](CO)C(=O)N[C@@H](CCCNC(N)=N)C(=O)NCC(=O)N[C@@H](CCCCNC(=O)CN3CCN(CC(O)=O)CCN(CC(O)=O)CCN(CC(O)=O)CC3)C(=O)N[C@@H](CCCNC(N)=N)C(=O)N[C@@H](CC(N)=O)C(=O)N[C@@H](CC(N)=O)C(=O)N[C@@H](Cc3ccccc3)C(=O)N[C@@H](CCCC[n+]3c(C)cc(\C=C\C=C\c4ccc(cc4)N(C)C)cc3C)C(=O)N[C@@H]([C@@H](C)O)C(=O)N[C@@H](CCC(O)=O)C(=O)N[C@@H](CCC(O)=O)C(=O)N[C@@H](Cc3ccc(O)cc3)C(O)=O)C2=O)cc(C(=O)NC[C@@H]2CCCN2CC=C)c1OC