Reaction Details
TargetAldo-keto reductase family 1 member B1
LigandBDBM50015588
Substrate/Competitorn/a
Meas. Tech.ChEMBL_1348878 (CHEMBL3271147)
IC50 18±n/a nM
Citation Ovais, SPushpalatha, HReddy, GBRathore, PBashir, RYaseen, SDheyaa, AYaseen, RTanwar, OAkthar, MSamim, MJaved, K Synthesis and biological evaluation of some new pyrazoline substituted benzenesulfonylurea/thiourea derivatives as anti-hyperglycaemic agents and aldose reductase inhibitors. Eur J Med Chem80:209-17 (2014) 
 
Aldo-keto reductase family 1 member B1
Name:Aldo-keto reductase family 1 member B1
Type:PROTEIN
Mol. Mass.:35797.87
Organism:Rattus norvegicus
Description:ChEMBL_1512484
Residue:316
BDBM50015588
NameBDBM50015588
Synonyms:CHEMBL3260158
TypeSmall organic molecule
Emp. Form.C28H32ClN5O2S2
Mol. Mass.570.169
SMILESCCCCNC(=S)NS(=O)(=O)c1ccc(cc1)N1N=C(CC1c1ccc(Cl)cc1)c1ccc(cc1)N(C)C