Reaction Details
TargetCarbonic anhydrase 1
LigandBDBM10877
Substrate/Competitorn/a
Meas. Tech.ChEMBL_1349989 (CHEMBL3270415)
Ki 21000±n/a nM
Citation Nishimori, IVullo, DMinakuchi, TScozzafava, ACapasso, CSupuran, CT Sulfonamide inhibition studies of twoß-carbonic anhydrases from the bacterial pathogen Legionella pneumophila. Bioorg Med Chem22:2939-46 (2014) 
 
Carbonic anhydrase 1
Name:Carbonic anhydrase 1
Type:Enzyme
Mol. Mass.:28873.37
Organism:Homo sapiens (Human)
Description:P00915
Residue:261
BDBM10877
NameBDBM10877
Synonyms:4-(2-hydroxyethyl)benzene-1-sulfonamide JMC522226 Compound 21 aromatic/heteroaromatic sulfonamide 22
TypeSmall organic molecule
Emp. Form.C8H11NO3S
Mol. Mass.201.243
SMILESNS(=O)(=O)c1ccc(CCO)cc1