Reaction Details
TargetCarbonic anhydrase 1
LigandBDBM50013792
Substrate/Competitorn/a
Meas. Tech.ChEMBL_1349989 (CHEMBL3270415)
Ki 50±n/a nM
Citation Nishimori, IVullo, DMinakuchi, TScozzafava, ACapasso, CSupuran, CT Sulfonamide inhibition studies of twoß-carbonic anhydrases from the bacterial pathogen Legionella pneumophila. Bioorg Med Chem22:2939-46 (2014) 
 
Carbonic anhydrase 1
Name:Carbonic anhydrase 1
Type:Enzyme
Mol. Mass.:28873.37
Organism:Homo sapiens (Human)
Description:P00915
Residue:261
BDBM50013792
NameBDBM50013792
Synonyms:CHEBI:6822 Neptazane
TypeSmall organic molecule
Emp. Form.C5H8N4O3S2
Mol. Mass.236.272
SMILESCC(=O)\N=c1\sc(nn1C)S(N)(=O)=O