Reaction Details
TargetCarbonic anhydrase 2
LigandBDBM50080733
Substrate/Competitorn/a
Meas. Tech.ChEMBL_1349990 (CHEMBL3270416)
Ki 46±n/a nM
Citation Nishimori, IVullo, DMinakuchi, TScozzafava, ACapasso, CSupuran, CT Sulfonamide inhibition studies of twoß-carbonic anhydrases from the bacterial pathogen Legionella pneumophila. Bioorg Med Chem22:2939-46 (2014) 
 
Carbonic anhydrase 2
Name:Carbonic anhydrase 2
Type:Enzyme
Mol. Mass.:29250.71
Organism:Homo sapiens (Human)
Description:P00918
Residue:260
BDBM50080733
NameBDBM50080733
Synonyms:4-(4-aminophenylsulfonamido)-1-benzenesulfonamide 4-amino-N-[4-(aminosulfonyl)phenyl]benzenesulfonamide CHEMBL269122 | cid_68351
TypeSmall organic molecule
Emp. Form.C12H13N3O4S2
Mol. Mass.327.379
SMILESNc1ccc(cc1)S(=O)(=O)Nc1ccc(cc1)S(N)(=O)=O