Reaction Details
TargetSodium-dependent serotonin transporter
LigandBDBM86234
Substrate/Competitorn/a
Meas. Tech.ChEMBL_1347685 (CHEMBL3271086)
Ki 24500±n/a nM
Citation Llabrés, SGarcía-Ratés, SCristóbal-Lecina, ERiera, ABorrell, JICamarasa, JPubill, DLuque, FJEscubedo, E Molecular basis of the selective binding of MDMA enantiomers to the alpha4beta2 nicotinic receptor subtype: synthesis, pharmacological evaluation and mechanistic studies. Eur J Med Chem81:35-46 (2014) 
 
Sodium-dependent serotonin transporter
Name:Sodium-dependent serotonin transporter
Type:Multi-pass membrane protein
Mol. Mass.:70168.43
Organism:Rattus norvegicus (rat)
Description:P31652
Residue:630
BDBM86234
NameBDBM86234
Synonyms:CAS_64057-70-1 NSC_126235
TypeSmall organic molecule
Emp. Form.C11H15NO2
Mol. Mass.193.2423
SMILESCN[C@H](C)Cc1ccc2OCOc2c1