Reaction Details
TargetXanthine dehydrogenase/oxidase
LigandBDBM50016702
Substrate/Competitorn/a
Meas. Tech.ChEMBL_1354804 (CHEMBL3279105)
Ki 24±n/a nM
Citation Springer, RHDimmitt, MKNovinson, TO'Brien, DERobins, RKSimon, LNMiller, JP Synthesis and enzymic activity of some novel xanthine oxidase inhibitors. 3-Substituted 5,7-dihydroxypyrazolo(1,5-alpha)pyrimidines. J Med Chem19:291-6 (1976) Xanthine dehydrogenase/oxidase
Name:Xanthine dehydrogenase/oxidase
Type:Protein
Mol. Mass.:146809.00
Organism:Bos taurus (Bovine)
Description:P80457
Residue:1332
BDBM50016702
NameBDBM50016702
Synonyms:CHEMBL3276844
TypeSmall organic molecule
Emp. Form.C13H11N3O2
Mol. Mass.241.2453
SMILESCc1ccc(cc1)-c1cnn2c(O)cc(O)nc12