Reaction Details
TargetXanthine dehydrogenase/oxidase
LigandBDBM50016666
Substrate/Competitorn/a
Meas. Tech.ChEMBL_1354805 (CHEMBL3279106)
Ki 5400±n/a nM
Citation Springer, RHDimmitt, MKNovinson, TO'Brien, DERobins, RKSimon, LNMiller, JP Synthesis and enzymic activity of some novel xanthine oxidase inhibitors. 3-Substituted 5,7-dihydroxypyrazolo(1,5-alpha)pyrimidines. J Med Chem19:291-6 (1976) Xanthine dehydrogenase/oxidase
Name:Xanthine dehydrogenase/oxidase
Type:Protein
Mol. Mass.:146809.00
Organism:Bos taurus (Bovine)
Description:P80457
Residue:1332
BDBM50016666
NameBDBM50016666
Synonyms:CHEMBL3276835
TypeSmall organic molecule
Emp. Form.C6H5N3O2
Mol. Mass.151.1228
SMILESOc1cc(O)n2nccc2n1