Reaction Details
TargetAcetylcholinesterase
LigandBDBM92962
Substrate/Competitorn/a
Meas. Tech.ChEMBL_1360667 (CHEMBL3282825)
pH8.25±n/a
Ki 14200000±n/a nM
Commentsextracted
Citation Alspach, JDIngraham, LL Inhibition of acetylcholinesterase by thiamine. A structure-function study. J Med Chem20:161-4 (1977) Acetylcholinesterase
Name:Acetylcholinesterase
Type:Enzyme
Mol. Mass.:71812.79
Organism:Electrophorus electricus (Electric eel)
Description:n/a
Residue:633
BDBM92962
NameBDBM92962
Synonyms:ThDP
TypeSmall molecule
Emp. Form.C12H19N4O7P2S
Mol. Mass.425.314
SMILESCc1c(CCOP(O)(=O)OP(O)(O)=O)sc[n+]1Cc1cnc(C)nc1N