Reaction Details
TargetCarboxylic ester hydrolase
LigandBDBM50016849
Substrate/Competitorn/a
Meas. Tech.ChEMBL_1355051 (CHEMBL3280465)
Ki 27±n/a nM
Citation Chen, WSCocolas, GHCavallito, CJChai, KJ Potent reversible anticholinesterase agents. Bis- and mono-N-substituted benzoquinolinium halides. J Med Chem20:1617-23 (1978) Carboxylic ester hydrolase
Name:Carboxylic ester hydrolase
Type:Protein
Mol. Mass.:68842.83
Organism:Equus caballus (Horse)
Description:Q9N1N9
Residue:602
BDBM50016849
NameBDBM50016849
Synonyms:CHEMBL3276410
TypeSmall organic molecule
Emp. Form.C32H30Br2N2
Mol. Mass.602.402
SMILES[Br-].[Br-].C(CCC[n+]1cc2ccccc2c2ccccc12)CC[n+]1cc2ccccc2c2ccccc12