Reaction Details
TargetCarboxylic ester hydrolase
LigandBDBM50016848
Substrate/Competitorn/a
Meas. Tech.ChEMBL_1355052 (CHEMBL3280466)
Ki 24±n/a nM
Citation Chen, WSCocolas, GHCavallito, CJChai, KJ Potent reversible anticholinesterase agents. Bis- and mono-N-substituted benzoquinolinium halides. J Med Chem20:1617-23 (1978) Carboxylic ester hydrolase
Name:Carboxylic ester hydrolase
Type:Protein
Mol. Mass.:68842.83
Organism:Equus caballus (Horse)
Description:Q9N1N9
Residue:602
BDBM50016848
NameBDBM50016848
Synonyms:CHEMBL3276408
TypeSmall organic molecule
Emp. Form.C32H30I2N2
Mol. Mass.696.4029
SMILES[I-].[I-].C(CCC[n+]1c2ccccc2cc2ccccc12)CC[n+]1c2ccccc2cc2ccccc12