Reaction Details
TargetCarboxylic ester hydrolase
LigandBDBM50016872
Substrate/Competitorn/a
Meas. Tech.ChEMBL_1355055 (CHEMBL3280469)
Ki 120±n/a nM
Citation Chen, WSCocolas, GHCavallito, CJChai, KJ Potent reversible anticholinesterase agents. Bis- and mono-N-substituted benzoquinolinium halides. J Med Chem20:1617-23 (1978) Carboxylic ester hydrolase
Name:Carboxylic ester hydrolase
Type:Protein
Mol. Mass.:68842.83
Organism:Equus caballus (Horse)
Description:Q9N1N9
Residue:602
BDBM50016872
NameBDBM50016872
Synonyms:CHEMBL3276421
TypeSmall organic molecule
Emp. Form.C17H16BrNO2
Mol. Mass.346.218
SMILES[Br-].CC(=O)OCC[n+]1cc2ccccc2c2ccccc12