Reaction Details
Target11-beta-hydroxysteroid dehydrogenase 1
LigandBDBM50016982
Substrate/Competitorn/a
Meas. Tech.ChEMBL_1364745 (CHEMBL3294006)
IC50 4.0±n/a nM
Citation Scott, JSGoldberg, FWTurnbull, AV Medicinal chemistry of inhibitors of 11ß-hydroxysteroid dehydrogenase type 1 (11ß-HSD1). J Med Chem57:4466-86 (2014) 
 
11-beta-hydroxysteroid dehydrogenase 1
Name:11-beta-hydroxysteroid dehydrogenase 1
Type:Enzyme
Mol. Mass.:32369.70
Organism:Mus musculus (mouse)
Description:P50172
Residue:292
BDBM50016982
NameBDBM50016982
Synonyms:CHEMBL3287027
TypeSmall organic molecule
Emp. Form.C22H27Cl3N4O4S
Mol. Mass.549.898
SMILESNC(=O)[C@@]12CC3CC(C[C@](C3)(C1)NC(=O)CN1CCCN(c3c(Cl)cc(Cl)cc3Cl)S1(=O)=O)C2