Reaction Details
Target11-beta-hydroxysteroid dehydrogenase 1
LigandBDBM50239401
Substrate/Competitorn/a
Meas. Tech.ChEMBL_1364746 (CHEMBL3294007)
IC50 8.0±n/a nM
Citation Scott, JSGoldberg, FWTurnbull, AV Medicinal chemistry of inhibitors of 11ß-hydroxysteroid dehydrogenase type 1 (11ß-HSD1). J Med Chem57:4466-86 (2014) 
 
11-beta-hydroxysteroid dehydrogenase 1
Name:11-beta-hydroxysteroid dehydrogenase 1
Type:Enzyme
Mol. Mass.:32409.16
Organism:Homo sapiens (Human)
Description:P28845
Residue:292
BDBM50239401
NameBDBM50239401
Synonyms:3-Adamantan-1-yl-6,7,8,9-tetrahydro-5H-[1,2,4]triazolo[4,3-a]azepine MERCK-544
TypeSmall organic molecule
Emp. Form.C17H25N3
Mol. Mass.271.4005
SMILESC1C2CC3CC1CC(C2)(C3)c1nnc2CCCCCn12