Reaction Details
TargetSphingosine kinase 1
LigandBDBM50443385
Substrate/Competitorn/a
Meas. Tech.ChEMBL_1364793 (CHEMBL3294301)
Ki 3000±n/a nM
Citation Plano, DAmin, SSharma, AK Importance of sphingosine kinase (SphK) as a target in developing cancer therapeutics and recent developments in the synthesis of novel SphK inhibitors. J Med Chem57:5509-24 (2014) 
 
Sphingosine kinase 1
Name:Sphingosine kinase 1
Type:Enzyme
Mol. Mass.:42521.16
Organism:Homo sapiens (Human)
Description:Q9NYA1
Residue:384
BDBM50443385
NameBDBM50443385
Synonyms:SPC-100270 Safingol HCl
TypeSmall organic molecule
Emp. Form.C18H39NO2
Mol. Mass.301.5078
[C@H](O)[C@@H](N)CO