Reaction Details
TargetSphingosine kinase 1
LigandBDBM50240721
Substrate/Competitorn/a
Meas. Tech.ChEMBL_1364794 (CHEMBL3294302)
Ki 5000±n/a nM
Citation Plano, DAmin, SSharma, AK Importance of sphingosine kinase (SphK) as a target in developing cancer therapeutics and recent developments in the synthesis of novel SphK inhibitors. J Med Chem57:5509-24 (2014) 
 
Sphingosine kinase 1
Name:Sphingosine kinase 1
Type:Enzyme
Mol. Mass.:42521.16
Organism:Homo sapiens (Human)
Description:Q9NYA1
Residue:384
BDBM50240721
NameBDBM50240721
Synonyms:(E)-(2S,3R)-2-Dimethylamino-octadec-4-ene-1,3-diol N,N-Dimethylsphingosine dimethylspingosine
TypeSmall organic molecule
Emp. Form.C20H41NO2
Mol. Mass.327.545
SMILESCCCCCCCCCCCCC\C=C\[C@@H](O)[C@H](CO)N(C)C