Reaction Details
TargetSphingosine kinase 1
LigandBDBM50017015
Substrate/Competitorn/a
Meas. Tech.ChEMBL_1364794 (CHEMBL3294302)
IC50 40±n/a nM
Citation Plano, DAmin, SSharma, AK Importance of sphingosine kinase (SphK) as a target in developing cancer therapeutics and recent developments in the synthesis of novel SphK inhibitors. J Med Chem57:5509-24 (2014) 
 
Sphingosine kinase 1
Name:Sphingosine kinase 1
Type:Enzyme
Mol. Mass.:42521.16
Organism:Homo sapiens (Human)
Description:Q9NYA1
Residue:384
BDBM50017015
NameBDBM50017015
Synonyms:CHEMBL3287035
TypeSmall organic molecule
Emp. Form.C19H40ClN3O2
Mol. Mass.377.993
SMILESCl.CCCCCCCCCCCCC\C=C\[C@H](O)[C@@H](CO)NC(N)=N