Reaction Details
TargetSphingosine kinase 2
LigandBDBM50017015
Substrate/Competitorn/a
Meas. Tech.ChEMBL_1364795 (CHEMBL3294303)
IC50 300±n/a nM
Citation Plano, DAmin, SSharma, AK Importance of sphingosine kinase (SphK) as a target in developing cancer therapeutics and recent developments in the synthesis of novel SphK inhibitors. J Med Chem57:5509-24 (2014) 
 
Sphingosine kinase 2
Name:Sphingosine kinase 2
Type:Protein
Mol. Mass.:69221.44
Organism:Homo sapiens (Human)
Description:Q9NRA0
Residue:654
BDBM50017015
NameBDBM50017015
Synonyms:CHEMBL3287035
TypeSmall organic molecule
Emp. Form.C19H40ClN3O2
Mol. Mass.377.993
SMILESCl.CCCCCCCCCCCCC\C=C\[C@H](O)[C@@H](CO)NC(N)=N