Reaction Details
TargetSphingosine kinase 2
LigandBDBM50393641
Substrate/Competitorn/a
Meas. Tech.ChEMBL_1364795 (CHEMBL3294303)
Ki 27000±n/a nM
Citation Plano, DAmin, SSharma, AK Importance of sphingosine kinase (SphK) as a target in developing cancer therapeutics and recent developments in the synthesis of novel SphK inhibitors. J Med Chem57:5509-24 (2014) 
 
Sphingosine kinase 2
Name:Sphingosine kinase 2
Type:Protein
Mol. Mass.:69221.44
Organism:Homo sapiens (Human)
Description:Q9NRA0
Residue:654
BDBM50393641
NameBDBM50393641
Synonyms:CHEMBL2158686
TypeSmall organic molecule
Emp. Form.C20H35NO2
Mol. Mass.321.4974
SMILESCCCCCCCCc1ccc(CC[C@@](N)(CO)COC)cc1