Reaction Details
TargetSphingosine kinase 2
LigandBDBM50443389
Substrate/Competitorn/a
Meas. Tech.ChEMBL_1365135 (CHEMBL3292342)
IC50 10000±n/a nM
Citation Plano, DAmin, SSharma, AK Importance of sphingosine kinase (SphK) as a target in developing cancer therapeutics and recent developments in the synthesis of novel SphK inhibitors. J Med Chem57:5509-24 (2014) 
 
Sphingosine kinase 2
Name:Sphingosine kinase 2
Type:Protein
Mol. Mass.:69221.44
Organism:Homo sapiens (Human)
Description:Q9NRA0
Residue:654
BDBM50443389
NameBDBM50443389
Synonyms:CHEMBL2376441
TypeSmall organic molecule
Emp. Form.C17H27NO2
Mol. Mass.277.4018
SMILESCCCCCc1ccc(\C=C\[C@H](O)[C@@H](CO)NC)cc1