Reaction Details
TargetSphingosine kinase 2
LigandBDBM50017016
Substrate/Competitorn/a
Meas. Tech.ChEMBL_1365136 (CHEMBL3292343)
Ki 4300±n/a nM
Citation Plano, DAmin, SSharma, AK Importance of sphingosine kinase (SphK) as a target in developing cancer therapeutics and recent developments in the synthesis of novel SphK inhibitors. J Med Chem57:5509-24 (2014) 
 
Sphingosine kinase 2
Name:Sphingosine kinase 2
Type:Protein
Mol. Mass.:69221.44
Organism:Homo sapiens (Human)
Description:Q9NRA0
Residue:654
BDBM50017016
NameBDBM50017016
Synonyms:CHEMBL3287036
TypeSmall organic molecule
Emp. Form.C18H24N2O3S
Mol. Mass.348.46
SMILESCCCCOc1ccc(CC\C=C2/SC(=O)N(CCN)C2=O)cc1