Reaction Details
TargetSphingosine kinase 2
LigandBDBM50017017
Substrate/Competitorn/a
Meas. Tech.ChEMBL_1365139 (CHEMBL3292346)
Ki 4200±n/a nM
Citation Plano, DAmin, SSharma, AK Importance of sphingosine kinase (SphK) as a target in developing cancer therapeutics and recent developments in the synthesis of novel SphK inhibitors. J Med Chem57:5509-24 (2014) 
 
Sphingosine kinase 2
Name:Sphingosine kinase 2
Type:Protein
Mol. Mass.:69221.44
Organism:Homo sapiens (Human)
Description:Q9NRA0
Residue:654
BDBM50017017
NameBDBM50017017
Synonyms:CHEMBL3287037
TypeSmall organic molecule
Emp. Form.C25H28ClNO3
Mol. Mass.425.948
SMILESOc1ccc(CCNC(=O)C23CC4CC(C2)CC(C4)(C3)c2ccc(Cl)cc2)cc1O