Reaction Details
TargetDelta-aminolevulinic acid dehydratase
LigandBDBM50017183
Substrate/Competitorn/a
Meas. Tech.ChEMBL_1365593 (CHEMBL3297374)
IC50 13000±n/a nM
Citation Lentz, CSHalls, VSHannam, JSStrassel, SLawrence, SHJaffe, EKFamulok, MHoerauf, APfarr, KM wALADin benzimidazoles differentially modulate the function of porphobilinogen synthase orthologs. J Med Chem57:2498-510 (2014) 
 
Delta-aminolevulinic acid dehydratase
Name:Delta-aminolevulinic acid dehydratase
Synonyms:n/a
Type:PROTEIN
Mol. Mass.:36671.06
Organism:Wolbachia sp. subsp. Brugia malayi (strain TRS)
Description:ChEMBL_108383
Residue:331
BDBM50017183
NameBDBM50017183
Synonyms:CHEMBL3287359
TypeSmall organic molecule
Emp. Form.C16H11F3N2O2
Mol. Mass.320.2659
SMILESOC(=O)c1ccc2n(Cc3cccc(c3)C(F)(F)F)cnc2c1