Reaction Details
TargetDelta-aminolevulinic acid dehydratase
LigandBDBM50017186
Substrate/Competitorn/a
Meas. Tech.ChEMBL_1365593 (CHEMBL3297374)
IC50 164000±n/a nM
Citation Lentz, CSHalls, VSHannam, JSStrassel, SLawrence, SHJaffe, EKFamulok, MHoerauf, APfarr, KM wALADin benzimidazoles differentially modulate the function of porphobilinogen synthase orthologs. J Med Chem57:2498-510 (2014) 
 
Delta-aminolevulinic acid dehydratase
Name:Delta-aminolevulinic acid dehydratase
Synonyms:n/a
Type:PROTEIN
Mol. Mass.:36671.06
Organism:Wolbachia sp. subsp. Brugia malayi (strain TRS)
Description:ChEMBL_108383
Residue:331
BDBM50017186
NameBDBM50017186
Synonyms:CHEMBL3287362
TypeSmall organic molecule
Emp. Form.C23H18F3N3O3S
Mol. Mass.473.468
SMILESOC(=O)c1cccc2nc(CCNC(=O)c3cccs3)n(Cc3cccc(c3)C(F)(F)F)c12