Reaction Details
TargetDelta-aminolevulinic acid dehydratase
LigandBDBM50017185
Substrate/Competitorn/a
Meas. Tech.ChEMBL_1365603 (CHEMBL3297384)
EC50 38000±n/a nM
Citation Lentz, CSHalls, VSHannam, JSStrassel, SLawrence, SHJaffe, EKFamulok, MHoerauf, APfarr, KM wALADin benzimidazoles differentially modulate the function of porphobilinogen synthase orthologs. J Med Chem57:2498-510 (2014) 
 
Delta-aminolevulinic acid dehydratase
Name:Delta-aminolevulinic acid dehydratase
Synonyms:hemB
Type:PROTEIN
Mol. Mass.:38534.14
Organism:Vibrio cholerae serotype O1 (strain M66-2)
Description:ChEMBL_108386
Residue:347
BDBM50017185
NameBDBM50017185
Synonyms:CHEMBL3287361
TypeSmall organic molecule
Emp. Form.C23H18F3N3O3S
Mol. Mass.473.468
SMILESOC(=O)c1cccc2n(Cc3cccc(c3)C(F)(F)F)c(CCNC(=O)c3cccs3)nc12