Reaction Details
TargetDelta-aminolevulinic acid dehydratase
LigandBDBM50441099
Substrate/Competitorn/a
Meas. Tech.ChEMBL_1365607 (CHEMBL3297388)
EC50 69000±n/a nM
Citation Lentz, CSHalls, VSHannam, JSStrassel, SLawrence, SHJaffe, EKFamulok, MHoerauf, APfarr, KM wALADin benzimidazoles differentially modulate the function of porphobilinogen synthase orthologs. J Med Chem57:2498-510 (2014) 
 
Delta-aminolevulinic acid dehydratase
Name:Delta-aminolevulinic acid dehydratase
Type:PROTEIN
Mol. Mass.:37028.00
Organism:Pseudomonas aeruginosa (strain ATCC 15692 / PAO1 / 1C / PRS 101 / LMG12228)
Description:ChEMBL_108388
Residue:337
BDBM50441099
NameBDBM50441099
Synonyms:CHEMBL2430574
TypeSmall organic molecule
Emp. Form.C23H18F3N3O3S
Mol. Mass.473.468
SMILESOC(=O)c1ccc2n(Cc3cccc(c3)C(F)(F)F)c(CCNC(=O)c3cccs3)nc2c1