Reaction Details
TargetDelta-aminolevulinic acid dehydratase
LigandBDBM50017189
Substrate/Competitorn/a
Meas. Tech.ChEMBL_1365622 (CHEMBL3297469)
IC50>1000000±n/a nM
Citation Lentz, CSHalls, VSHannam, JSStrassel, SLawrence, SHJaffe, EKFamulok, MHoerauf, APfarr, KM wALADin benzimidazoles differentially modulate the function of porphobilinogen synthase orthologs. J Med Chem57:2498-510 (2014) 
 
Delta-aminolevulinic acid dehydratase
Name:Delta-aminolevulinic acid dehydratase
Type:PROTEIN
Mol. Mass.:35938.25
Organism:Drosophila melanogaster
Description:ChEMBL_108389
Residue:327
BDBM50017189
NameBDBM50017189
Synonyms:CHEMBL3287365
TypeSmall organic molecule
Emp. Form.C16H11F3N2O2
Mol. Mass.320.2659
SMILESOC(=O)c1ccc2n(Cc3ccccc3C(F)(F)F)cnc2c1