Reaction Details
TargetDelta-aminolevulinic acid dehydratase, chloroplastic
LigandBDBM50017187
Substrate/Competitorn/a
Meas. Tech.ChEMBL_1365592 (CHEMBL3297373)
IC50 44300±n/a nM
Citation Lentz, CSHalls, VSHannam, JSStrassel, SLawrence, SHJaffe, EKFamulok, MHoerauf, APfarr, KM wALADin benzimidazoles differentially modulate the function of porphobilinogen synthase orthologs. J Med Chem57:2498-510 (2014) 
 
Delta-aminolevulinic acid dehydratase, chloroplastic
Name:Delta-aminolevulinic acid dehydratase, chloroplastic
Type:PROTEIN
Mol. Mass.:43811.42
Organism:Pisum sativum
Description:ChEMBL_108384
Residue:398
BDBM50017187
NameBDBM50017187
Synonyms:CHEMBL3287363
TypeSmall organic molecule
Emp. Form.C23H18F3N3O3S
Mol. Mass.473.468
SMILESOC(=O)c1ccc2n(Cc3ccc(cc3)C(F)(F)F)c(CCNC(=O)c3cccs3)nc2c1