Reaction Details
TargetCytochrome P450 2C9
LigandBDBM50017296
Substrate/Competitorn/a
Meas. Tech.ChEMBL_1362434 (CHEMBL3292790)
IC50 251±n/a nM
Citation De Savi, CCox, RJWarner, DJCook, ARDickinson, MRMcDonough, AMorrill, LCParker, BAndrews, GYoung, SSGilmour, PSRiley, RDearman, MS Efficacious inhaled PDE4 inhibitors with low emetic potential and long duration of action for the treatment of COPD. J Med Chem57:4661-76 (2014) 
 
Cytochrome P450 2C9
Name:Cytochrome P450 2C9
Type:Enzyme
Mol. Mass.:55636.33
Organism:Homo sapiens (Human)
Description:P11712
Residue:490
BDBM50017296
NameBDBM50017296
Synonyms:CHEMBL3287739
TypeSmall organic molecule
Emp. Form.C35H39FN6O5
Mol. Mass.642.7198
SMILESCc1cc(nn1C)C(=O)N[C@H]1CC[C@H](CC1)NC(=O)c1cc(F)cnc1Oc1cccc(c1)-c1ccc(O)cc1CN1CCOCC1