Reaction Details
TargetcAMP-specific 3',5'-cyclic phosphodiesterase 4B
LigandBDBM50017310
Substrate/Competitorn/a
Meas. Tech.ChEMBL_1362418 (CHEMBL3292526)
IC50 0.050119±n/a nM
Citation De Savi, CCox, RJWarner, DJCook, ARDickinson, MRMcDonough, AMorrill, LCParker, BAndrews, GYoung, SSGilmour, PSRiley, RDearman, MS Efficacious inhaled PDE4 inhibitors with low emetic potential and long duration of action for the treatment of COPD. J Med Chem57:4661-76 (2014) 
 
cAMP-specific 3',5'-cyclic phosphodiesterase 4B
Name:cAMP-specific 3',5'-cyclic phosphodiesterase 4B
Type:Protein
Mol. Mass.:83318.87
Organism:Homo sapiens (Human)
Description:Q07343
Residue:736
BDBM50017310
NameBDBM50017310
Synonyms:CHEMBL3287996
TypeSmall organic molecule
Emp. Form.C36H37FN6O4
Mol. Mass.636.7152
SMILESCN(C)Cc1cc(O)ccc1-c1cccc(Oc2ncc(F)cc2C(=O)N[C@@H]2CC[C@@H](CC2)NC(=O)c2cn3c(C)cccc3n2)c1