Reaction Details
TargetcAMP-specific 3',5'-cyclic phosphodiesterase 4B
LigandBDBM50017315
Substrate/Competitorn/a
Meas. Tech.ChEMBL_1362418 (CHEMBL3292526)
IC50 0.031623±n/a nM
Citation De Savi, CCox, RJWarner, DJCook, ARDickinson, MRMcDonough, AMorrill, LCParker, BAndrews, GYoung, SSGilmour, PSRiley, RDearman, MS Efficacious inhaled PDE4 inhibitors with low emetic potential and long duration of action for the treatment of COPD. J Med Chem57:4661-76 (2014) 
 
cAMP-specific 3',5'-cyclic phosphodiesterase 4B
Name:cAMP-specific 3',5'-cyclic phosphodiesterase 4B
Type:Protein
Mol. Mass.:83318.87
Organism:Homo sapiens (Human)
Description:Q07343
Residue:736
BDBM50017315
NameBDBM50017315
Synonyms:CHEMBL3288001
TypeSmall organic molecule
Emp. Form.C38H41FN4O6
Mol. Mass.668.7537
SMILESCc1cccc(O)c1C(=O)N[C@@H]1CC[C@@H](CC1)NC(=O)c1cc(F)cnc1Oc1cccc(c1)-c1ccc(O)cc1CN1CCCOCC1